BDBM50000283 1-[2-(3,4-Dichloro-phenyl)-acetyl]-6-pyrrolidin-1-ylmethyl-piperidin-3-one::CHEMBL344541
SMILES Clc1ccc(CC(=O)N2CC(=O)CC[C@H]2CN2CCCC2)cc1Cl
InChI Key InChIKey=JOEMGACWLKVQLY-AWEZNQCLSA-N
Data  1 IC50
  Tab Delimited (TSV)   2D SDfile   Computed 3D by Vconf -m prep SDfile
Find this compound or compounds like it in BindingDB:
Activity Spreadsheet -- Enzyme Inhibition Constant Data from BindingDB
Found 1 hit for monomerid = 50000283
TargetKappa-type opioid receptor(Homo sapiens (Human))
Glaxo Group Research
Curated by ChEMBL
LigandPNGBDBM50000283(1-[2-(3,4-Dichloro-phenyl)-acetyl]-6-pyrrolidin-1-...)
Affinity DataIC50:  390nM. Assay description: Opioid receptor kappa 1 agonist potency was determined in vitro using rabbit vas deferens (LVD) preparation
In DepthDetails ArticlePubMed