BDBM50000506 3-(2-{2-[2-(2-{2-[2-Amino-3-(4-hydroxy-phenyl)-propionylamino]-propionylamino}-3-phenyl-propionylamino)-3-(3H-imidazol-4-yl)-propionylamino]-4-methyl-pentanoylamino}-4-methylsulfanyl-butyrylamino)-succinamic acid::CHEMBL20956
SMILES CSCC[C@H](NC(=O)[C@H](CC(C)C)NC(=O)[C@H](Cc1cnc[nH]1)NC(=O)[C@H](Cc1ccccc1)NC(=O)[C@@H](C)NC(=O)[C@@H](N)Cc1ccc(O)cc1)C(=O)N[C@@H](CC(O)=O)C(N)=O
InChI Key InChIKey=UTZUXRKYGNWFEH-CHEANQQOSA-N
Data  2 KI
  Tab Delimited (TSV)   2D SDfile   Computed 3D by Vconf -m prep SDfile
Find this compound or compounds like it in BindingDB:
Activity Spreadsheet -- Enzyme Inhibition Constant Data from BindingDB
Found 2 hits for monomerid = 50000506
TargetDelta-type opioid receptor(Rattus norvegicus (rat))
National Institute Of Environmental Health Sciences
Curated by ChEMBL
LigandPNGBDBM50000506(3-(2-{2-[2-(2-{2-[2-Amino-3-(4-hydroxy-phenyl)-pro...)
Affinity DataKi:  0.360nM. Assay description: Compound was tested for its binding affinity against opioid receptor delta using [3H]-DPDPE as radioligand.
In DepthDetails ArticlePubMed
TargetMu-type opioid receptor(Rattus norvegicus (rat))
National Institute Of Environmental Health Sciences
Curated by ChEMBL
LigandPNGBDBM50000506(3-(2-{2-[2-(2-{2-[2-Amino-3-(4-hydroxy-phenyl)-pro...)
Affinity DataKi:  44nM. Assay description: Compound was tested for its binding affinity against opioid receptor mu using [3H]-DAGO as radioligand.
In DepthDetails ArticlePubMed