BDBM50000613 6-[6-(4-Hydroxy-piperidin-1-yl)-hexyloxy]-3-methoxy-2-phenyl-chromen-4-one::CHEMBL37470
SMILES COc1c(oc2ccc(OCCCCCCN3CCC(O)CC3)cc2c1=O)-c1ccccc1
InChI Key InChIKey=GLPQOACEPRECSA-UHFFFAOYSA-N
Data  1 KI  2 IC50
  Tab Delimited (TSV)   2D SDfile   Computed 3D by Vconf -m prep SDfile
Find this compound or compounds like it in BindingDB:
Activity Spreadsheet -- Enzyme Inhibition Constant Data from BindingDB
Found 3 hits for monomerid = 50000613
TargetD(2) dopamine receptor(Rattus norvegicus (rat))
Nova Pharmaceutical
Curated by ChEMBL
LigandPNGBDBM50000613(6-[6-(4-Hydroxy-piperidin-1-yl)-hexyloxy]-3-methox...)
Affinity DataKi:  2.60E+3nM. Assay description: Affinity towards dopamine receptor D2 was determined by competition studies using [3H]-sulpiride in rat striatum.
In DepthDetails ArticlePubMed
TargetSigma non-opioid intracellular receptor 1(Homo sapiens (Human))
Nova Pharmaceutical
Curated by ChEMBL
LigandPNGBDBM50000613(6-[6-(4-Hydroxy-piperidin-1-yl)-hexyloxy]-3-methox...)
Affinity DataIC50:  106nM. Assay description: Potency at the sigma binding site was determined in radioligand
In DepthDetails ArticlePubMed
TargetSigma non-opioid intracellular receptor 1(Homo sapiens (Human))
Nova Pharmaceutical
Curated by ChEMBL
LigandPNGBDBM50000613(6-[6-(4-Hydroxy-piperidin-1-yl)-hexyloxy]-3-methox...)
Affinity DataIC50:  93nM. Assay description: Potency at the sigma binding site was determined in radioligand
In DepthDetails ArticlePubMed