BDBM50000614 6-{6-[4-(4-Chloro-phenyl)-4-hydroxy-piperidin-1-yl]-hexyloxy}-2-phenyl-chromen-4-one::CHEMBL289896
SMILES OC1(CCN(CCCCCCOc2ccc3oc(cc(=O)c3c2)-c2ccccc2)CC1)c1ccc(Cl)cc1
InChI Key InChIKey=NWIUHJOQNRALHQ-UHFFFAOYSA-N
Data  1 KI  2 IC50
  Tab Delimited (TSV)   2D SDfile   Computed 3D by Vconf -m prep SDfile
Find this compound or compounds like it in BindingDB:
Activity Spreadsheet -- Enzyme Inhibition Constant Data from BindingDB
Found 3 hits for monomerid = 50000614
TargetD(2) dopamine receptor(Rattus norvegicus (rat))
Nova Pharmaceutical
Curated by ChEMBL
LigandPNGBDBM50000614(6-{6-[4-(4-Chloro-phenyl)-4-hydroxy-piperidin-1-yl...)
Affinity DataKi:  990nM. Assay description: Affinity towards dopamine receptor D2 site was determined by competition studies using [3H]-sulpiride in rat striatum.
In DepthDetails ArticlePubMed
TargetSigma non-opioid intracellular receptor 1(Homo sapiens (Human))
Nova Pharmaceutical
Curated by ChEMBL
LigandPNGBDBM50000614(6-{6-[4-(4-Chloro-phenyl)-4-hydroxy-piperidin-1-yl...)
Affinity DataIC50:  53nM. Assay description: Potency at the sigma binding site was determined in radioligand
In DepthDetails ArticlePubMed
TargetSigma non-opioid intracellular receptor 1(Homo sapiens (Human))
Nova Pharmaceutical
Curated by ChEMBL
LigandPNGBDBM50000614(6-{6-[4-(4-Chloro-phenyl)-4-hydroxy-piperidin-1-yl...)
Affinity DataIC50:  109nM. Assay description: Potency at the sigma binding site was determined in radioligand
In DepthDetails ArticlePubMed