BDBM50000709 5-{7-[4-(4-Fluoro-phenyl)-1-methyl-butyl]-5-methoxy-10,10-dimethyl-1,2,4,10-tetrahydro-9-oxa-3-aza-phenanthren-3-yl}-pentanoic acid::CHEMBL65199
SMILES COc1cc(cc2OC(C)(C)C3=C(CN(CCCCC(O)=O)CC3)c12)C(C)CCCc1ccc(F)cc1
InChI Key InChIKey=UBOQJBBPZXYJQV-UHFFFAOYSA-N
Data  1 KI
  Tab Delimited (TSV)   2D SDfile   Computed 3D by Vconf -m prep SDfile
Find this compound or compounds like it in BindingDB:
Activity Spreadsheet -- Enzyme Inhibition Constant Data from BindingDB
Found 1 hit for monomerid = 50000709
TargetPlatelet-activating factor receptor(Cavia porcellus)
Abbott Laboratories
Curated by ChEMBL
LigandPNGBDBM50000709(5-{7-[4-(4-Fluoro-phenyl)-1-methyl-butyl]-5-methox...)
Affinity DataKi:  5.50E+3nM. Assay description: In vitro intrinsic binding affinity at platelet activating factor receptor using rabbit platelet membranes
In DepthDetails ArticlePubMed