BDBM50000725 7-[4-(4-Fluoro-phenyl)-1-methyl-butyl]-10,10-dimethyl-2,3,4,10-tetrahydro-1H-9-oxa-3-aza-phenanthren-5-ol::CHEMBL62822
SMILES CC(CCCc1ccc(F)cc1)c1cc(O)c2C3=C(CCNC3)C(C)(C)Oc2c1
InChI Key InChIKey=YNFWSTXBMUTEJF-UHFFFAOYSA-N
Data  1 KI
  Tab Delimited (TSV)   2D SDfile   Computed 3D by Vconf -m prep SDfile
Find this compound or compounds like it in BindingDB:
Activity Spreadsheet -- Enzyme Inhibition Constant Data from BindingDB
Found 1 hit for monomerid = 50000725
TargetPlatelet-activating factor receptor(Cavia porcellus)
Abbott Laboratories
Curated by ChEMBL
LigandPNGBDBM50000725(7-[4-(4-Fluoro-phenyl)-1-methyl-butyl]-10,10-dimet...)
Affinity DataKi:  1.18E+4nM. Assay description: In vitro intrinsic binding affinity at platelet activating factor receptor using rabbit platelet membranes
In DepthDetails ArticlePubMed