BDBM50000820 CHEMBL263523
SMILES CC[C@H](C)[C@H](NC(=O)[C@@H](C[C@H](O)[C@H](CC(C)C)NC(=O)[C@H](Cc1c[nH]cn1)NC(=O)[C@H](Cc1ccccc1)NC(=O)[C@H]1CCCN1C(=O)[C@H](Cc1c[nH]cn1)NC(=O)OC(C)(C)C)C(C)C)C(=O)N[C@@H](Cc1c[nH]cn1)C(O)=O
InChI Key InChIKey=XZAZZMPUCLUZOP-PAYJKPSXSA-N
Data  1 KI
  Tab Delimited (TSV)   2D SDfile   Computed 3D by Vconf -m prep SDfile
Find this compound or compounds like it in BindingDB:
Activity Spreadsheet -- Enzyme Inhibition Constant Data from BindingDB
Found 1 hit for monomerid = 50000820
TargetGag-Pol polyprotein [489-587](Human immunodeficiency virus type 1)
Ciba-Geigy
Curated by ChEMBL
LigandPNGBDBM50000820(CHEMBL263523)
Affinity DataKi:  8.70nM. Assay description: Binding affinity to HIV-1 proteaseChecked by Author
In DepthDetails ArticlePubMed