BDBM50000848 4-Methoxy-4-[3-(naphthalen-2-ylmethoxy)-phenyl]-cyclohexanone (0.3 hydrate)::CHEMBL85123
SMILES COC1(CCC(=O)CC1)c1cccc(OCc2ccc3ccccc3c2)c1
InChI Key InChIKey=VKGBYEMUVGAZBA-UHFFFAOYSA-N
Data  1 IC50
  Tab Delimited (TSV)   2D SDfile   Computed 3D by Vconf -m prep SDfile
Find this compound or compounds like it in BindingDB:
Activity Spreadsheet -- Enzyme Inhibition Constant Data from BindingDB
Found 1 hit for monomerid = 50000848
TargetPolyunsaturated fatty acid 5-lipoxygenase(Homo sapiens (Human))
Ici Pharmaceuticals Group
Curated by ChEMBL
LigandPNGBDBM50000848(4-Methoxy-4-[3-(naphthalen-2-ylmethoxy)-phenyl]-cy...)
Affinity DataIC50:  3.40E+3nM. Assay description: In vitro inhibition of leukotriene B4 synthesis in human whole blood by inhibiting 5-lipoxygenase
In DepthDetails ArticlePubMed