BDBM50001045 6,11-Dimethyl-3-(3-phenyl-propyl)-1,2,3,4,5,6-hexahydro-2,6-methano-benzo[d]azocin-8-ol; hydrochloride::CHEMBL2367802
SMILES [H][C@@]12Cc3ccc(O)cc3[C@](C)(CCN1CCC(C)C)[C@@H]2C
InChI Key InChIKey=FMTVBXORMSFNHS-MDASCCDHSA-N
Data  1 KI
  Tab Delimited (TSV)   2D SDfile   Computed 3D by Vconf -m prep SDfile
Find this compound or compounds like it in BindingDB:
Activity Spreadsheet -- Enzyme Inhibition Constant Data from BindingDB
Found 1 hit for monomerid = 50001045
TargetMu-type opioid receptor(Rattus norvegicus (rat))
Research Triangle Institute
Curated by ChEMBL
LigandPNGBDBM50001045(6,11-Dimethyl-3-(3-phenyl-propyl)-1,2,3,4,5,6-hexa...)
Affinity DataKi:  3.50E+3nM. Assay description: Binding affinity against opioid receptor mu using [3H]-DAMGO as radioligand.
In DepthDetails ArticlePubMed