BDBM50001251 1-(8-Methoxy-4-o-tolylamino-quinolin-3-yl)-butan-1-ol (0.5H2O)::CHEMBL116786
SMILES CCCC(O)c1cnc2c(OC)cccc2c1Nc1ccccc1C
InChI Key InChIKey=QAGWRXTZANBLKN-UHFFFAOYSA-N
Data  1 IC50
  Tab Delimited (TSV)   2D SDfile   Computed 3D by Vconf -m prep SDfile
Find this compound or compounds like it in BindingDB:
Activity Spreadsheet -- Enzyme Inhibition Constant Data from BindingDB
Found 1 hit for monomerid = 50001251
TargetPotassium-transporting ATPase alpha chain 1/subunit beta(Sus scrofa (Pig))
Smithkline Beecham Pharmaceuticals R&D
Curated by ChEMBL
LigandPNGBDBM50001251(1-(8-Methoxy-4-o-tolylamino-quinolin-3-yl)-butan-1...)
Affinity DataIC50:  5.50E+4nM. Assay description: Inhibition of Shh signaling in mouse Shh-light2 cells by Gli-dependent firefly luciferase reporter gene assay
In DepthDetails ArticlePubMed