BDBM50001258 CHEMBL326168::Cyclopentyl-(8-methoxy-4-o-tolylamino-quinolin-3-yl)-methanone
SMILES COc1cccc2c(Nc3ccccc3C)c(cnc12)C(=O)C1CCCC1
InChI Key InChIKey=NVBZLGYBAAWBAJ-UHFFFAOYSA-N
Data  1 IC50
  Tab Delimited (TSV)   2D SDfile   Computed 3D by Vconf -m prep SDfile
Find this compound or compounds like it in BindingDB:
Activity Spreadsheet -- Enzyme Inhibition Constant Data from BindingDB
Found 1 hit for monomerid = 50001258
TargetPotassium-transporting ATPase alpha chain 1/subunit beta(Sus scrofa (Pig))
Smithkline Beecham Pharmaceuticals R&D
Curated by ChEMBL
LigandPNGBDBM50001258(CHEMBL326168 | Cyclopentyl-(8-methoxy-4-o-tolylami...)
Affinity DataIC50:  1.70E+3nM. Assay description: Concentration required to inhibit the activity of K+ stimulated gastric ATPase
In DepthDetails ArticlePubMed