BDBM50001273 3-((2-Carbamoyl-ethylsulfanyl)-{3-[2-(7-chloro-quinolin-2-yl)-vinyl]-phenyl}-methylsulfanyl)-propionic acid::CHEMBL124095
SMILES NC(=O)CCSC(SCCC(O)=O)c1cccc(\C=C\c2ccc3ccc(Cl)cc3n2)c1
InChI Key InChIKey=GFLLPUKOZOHDNV-XBXARRHUSA-N
Data  1 IC50
  Tab Delimited (TSV)   2D SDfile   Computed 3D by Vconf -m prep SDfile
Find this compound or compounds like it in BindingDB:
Activity Spreadsheet -- Enzyme Inhibition Constant Data from BindingDB
Found 1 hit for monomerid = 50001273
TargetCysteinyl leukotriene receptor 1(GUINEA PIG)
Merck Frosst Centre For Therapeutic Research
Curated by ChEMBL
LigandPNGBDBM50001273(3-((2-Carbamoyl-ethylsulfanyl)-{3-[2-(7-chloro-qui...)
Affinity DataIC50:  0.300nM. Assay description: In vitro inhibition of [3H]LTD4 binding to guinea pig lung membranes
In DepthDetails ArticlePubMed