BDBM50001295 CHEMBL338166::dilithium; 3-((2-carboxy-ethylsulfanyl)-{3-[(quinoline-2-carbonyl)-amino]-phenyl}-methylsulfanyl)-propionate
SMILES [O-]C(=O)CCSC(SCCC([O-])=O)c1cccc(NC(=O)c2ccc3ccccc3n2)c1
InChI Key InChIKey=QCNNTKHIVOJMKR-UHFFFAOYSA-L
Data  1 IC50
  Tab Delimited (TSV)   2D SDfile   Computed 3D by Vconf -m prep SDfile
Find this compound or compounds like it in BindingDB:
Activity Spreadsheet -- Enzyme Inhibition Constant Data from BindingDB
Found 1 hit for monomerid = 50001295
TargetCysteinyl leukotriene receptor 1(GUINEA PIG)
Merck Frosst Centre For Therapeutic Research
Curated by ChEMBL
LigandPNGBDBM50001295(CHEMBL338166 | dilithium; 3-((2-carboxy-ethylsulfa...)
Affinity DataIC50:  440nM. Assay description: In vitro inhibition of [3H]LTD4 binding to guinea pig lung membranes
In DepthDetails ArticlePubMed