BDBM50001310 13-butyl-24-(1H-4-imidazolylmethyl)-16-(1H-3-indolylmethyl)-(6aR,16R,18aS,24R,26aS)-perhydrodipyrido[1,2-a:1,2-d]pyrrolo[1,2-j][1,4,7,10,13,16]hexaazacyclooctadecine-6,12,15,18,23,26-hexaone::CHEMBL405289
SMILES CCCC[C@@H]1NC(=O)[C@@H](Cc2c[nH]c3ccccc23)NC(=O)[C@@H]2CCCN2C(=O)[C@@H](Cc2cnc[nH]2)NC(=O)[C@@H]2CCCCN2C(=O)[C@H]2CCCCN2C1=O
InChI Key InChIKey=FWBXLUTVLNUHQO-QYVXQROWSA-N
Data  3 IC50
  Tab Delimited (TSV)   2D SDfile   Computed 3D by Vconf -m prep SDfile
Find this compound or compounds like it in BindingDB:
Activity Spreadsheet -- Enzyme Inhibition Constant Data from BindingDB
Found 3 hits for monomerid = 50001310
TargetVasopressin V1a receptor(RAT)
Merck Research Laboratories
Curated by ChEMBL
LigandPNGBDBM50001310(13-butyl-24-(1H-4-imidazolylmethyl)-16-(1H-3-indol...)
Affinity DataIC50:  1.30E+3nM. Assay description: Concentration required to displace 50% of [3H]arginine vasopressin from rat liver arginine vasopressin 1A (AVP-V1a) site.
In DepthDetails ArticlePubMed
TargetVasopressin V2 receptor(Rattus norvegicus (Rat))
Merck Research Laboratories
Curated by ChEMBL
LigandPNGBDBM50001310(13-butyl-24-(1H-4-imidazolylmethyl)-16-(1H-3-indol...)
Affinity DataIC50:  1.70E+3nM. Assay description: Inhibition of [3H]arginine vasopressin binding to AVP-V2 site in rat kidney medulla.
In DepthDetails ArticlePubMed
TargetOxytocin receptor(RAT)
Merck Research Laboratories
Curated by ChEMBL
LigandPNGBDBM50001310(13-butyl-24-(1H-4-imidazolylmethyl)-16-(1H-3-indol...)
Affinity DataIC50:  72nM. Assay description: Concentration required to displace 50% of [3H]oxytocin from rat uterine receptor.
In DepthDetails ArticlePubMed