BDBM50001347 7,7-dimethyl-1-spiro[2,3-dihydro-1H-indene-1,4'-(hexahydropyridine)]-1-ylsulfonylmethylbicyclo[2.2.1]heptan-2-ol::CHEMBL127118
SMILES CC1(C)C2CC[C@@]1(CS(=O)(=O)N1CCC3(CC1)C=Cc1ccccc31)[C@@H](O)C2
InChI Key InChIKey=WHOYCZAZHQFDDJ-KTCLZCMPSA-N
Data  3 IC50
  Tab Delimited (TSV)   2D SDfile   Computed 3D by Vconf -m prep SDfile
Find this compound or compounds like it in BindingDB:
Activity Spreadsheet -- Enzyme Inhibition Constant Data from BindingDB
Found 3 hits for monomerid = 50001347
TargetOxytocin receptor(RAT)
Merck Research Laboratories
Curated by ChEMBL
LigandPNGBDBM50001347(7,7-dimethyl-1-spiro[2,3-dihydro-1H-indene-1,4'-(h...)
Affinity DataIC50:  2.20E+3nM. Assay description: Half-maximal inhibition of binding of [3H]-Oxytocin to OT receptor in rat uterine tissue
In DepthDetails ArticlePubMed
TargetVasopressin V1a/V1b/V2 receptor(RAT)
Merck Research Laboratories
Curated by ChEMBL
LigandPNGBDBM50001347(7,7-dimethyl-1-spiro[2,3-dihydro-1H-indene-1,4'-(h...)
Affinity DataIC50: >1.00E+5nM. Assay description: Half-maximal inhibition of binding of [3H]- vasopressin to the vasopressin receptor 2 in rat kidney
In DepthDetails ArticlePubMed
TargetVasopressin V1a/V1b/V2 receptor(RAT)
Merck Research Laboratories
Curated by ChEMBL
LigandPNGBDBM50001347(7,7-dimethyl-1-spiro[2,3-dihydro-1H-indene-1,4'-(h...)
Affinity DataIC50: >1.00E+4nM. Assay description: Half-maximal inhibition of binding of [3H]vasopressin to vasopressin receptor 1 in rat liver
In DepthDetails ArticlePubMed