BDBM50001392 C-(7,7-Dimethyl-2-oxo-bicyclo[2.2.1]hept-1-yl)-N-(2-indan-1-yl-ethyl)-methanesulfonamide::CHEMBL339093
SMILES CC1(C)C2CC[C@@]1(CS(=O)(=O)NCCC1CCc3ccccc13)C(=O)C2
InChI Key InChIKey=DZAYYWWKNAJEMF-MYKUNDNFSA-N
Data  3 IC50
  Tab Delimited (TSV)   2D SDfile   Computed 3D by Vconf -m prep SDfile
Find this compound or compounds like it in BindingDB:
Activity Spreadsheet -- Enzyme Inhibition Constant Data from BindingDB
Found 3 hits for monomerid = 50001392
TargetOxytocin receptor(RAT)
Merck Research Laboratories
Curated by ChEMBL
LigandPNGBDBM50001392(C-(7,7-Dimethyl-2-oxo-bicyclo[2.2.1]hept-1-yl)-N-(...)
Affinity DataIC50:  2.20E+3nM. Assay description: Half-maximal inhibition of binding of [3H]-Oxytocin to OT receptor in rat uterine tissue
In DepthDetails ArticlePubMed
TargetVasopressin V1a/V1b/V2 receptor(RAT)
Merck Research Laboratories
Curated by ChEMBL
LigandPNGBDBM50001392(C-(7,7-Dimethyl-2-oxo-bicyclo[2.2.1]hept-1-yl)-N-(...)
Affinity DataIC50: >1.00E+4nM. Assay description: Half-maximal inhibition of binding of [3H]- vasopressin to the vasopressin receptor 2 in rat kidney
In DepthDetails ArticlePubMed
TargetVasopressin V1a/V1b/V2 receptor(RAT)
Merck Research Laboratories
Curated by ChEMBL
LigandPNGBDBM50001392(C-(7,7-Dimethyl-2-oxo-bicyclo[2.2.1]hept-1-yl)-N-(...)
Affinity DataIC50: >1.00E+4nM. Assay description: Half-maximal inhibition of binding of [3H]vasopressin to vasopressin receptor 1 in rat liver
In DepthDetails ArticlePubMed