BDBM50001405 1'-(4-methylphenylsulfonyl)spiro[1H-indene-1,4'-(hexahydropyridine)]::CHEMBL341490
SMILES Cc1ccc(cc1)S(=O)(=O)N1CCC2(CC1)C=Cc1ccccc21
InChI Key InChIKey=VRVIZJNFYYAUKC-UHFFFAOYSA-N
Data  4 KI  3 IC50
  Tab Delimited (TSV)   2D SDfile   Computed 3D by Vconf -m prep SDfile
Find this compound or compounds like it in BindingDB:
Activity Spreadsheet -- Enzyme Inhibition Constant Data from BindingDB
Found 7 hits for monomerid = 50001405
TargetOxytocin receptor(Homo sapiens (Human))
Drugmoldesign
Curated by ChEMBL
LigandPNGBDBM50001405(1'-(4-methylphenylsulfonyl)spiro[1H-indene-1,4'-(h...)
Affinity DataKi:  1.00E+3nM. Assay description: Displacement of [3H]-oxytocin from oxytocin receptor in human uterus tissue
In DepthDetails ArticlePubMed
TargetOxytocin receptor(RAT)
Drugmoldesign
Curated by ChEMBL
LigandPNGBDBM50001405(1'-(4-methylphenylsulfonyl)spiro[1H-indene-1,4'-(h...)
Affinity DataKi:  1.60E+3nM. Assay description: Displacement of [3H]-oxytocin from oxytocin receptor in rat uterus tissue
In DepthDetails ArticlePubMed
TargetVasopressin V1a receptor(RAT)
Drugmoldesign
Curated by ChEMBL
LigandPNGBDBM50001405(1'-(4-methylphenylsulfonyl)spiro[1H-indene-1,4'-(h...)
Affinity DataKi:  9.80E+3nM. Assay description: Displacement of [3H]-vasopressin from vasopressin V1a receptor in rat liver tissue
In DepthDetails ArticlePubMed
TargetVasopressin V2 receptor(Rattus norvegicus (Rat))
Drugmoldesign
Curated by ChEMBL
LigandPNGBDBM50001405(1'-(4-methylphenylsulfonyl)spiro[1H-indene-1,4'-(h...)
Affinity DataKi: >4.00E+4nM. Assay description: Displacement of [3H]-vasopressin from vasopressin V2 receptor in rat kidney tissue
In DepthDetails ArticlePubMed
TargetVasopressin V1a/V1b/V2 receptor(RAT)
Merck Research Laboratories
Curated by ChEMBL
LigandPNGBDBM50001405(1'-(4-methylphenylsulfonyl)spiro[1H-indene-1,4'-(h...)
Affinity DataIC50:  3.50E+4nM. Assay description: Half-maximal inhibition of binding of [3H]vasopressin to vasopressin receptor 1 in rat liver
In DepthDetails ArticlePubMed
TargetVasopressin V1a/V1b/V2 receptor(RAT)
Merck Research Laboratories
Curated by ChEMBL
LigandPNGBDBM50001405(1'-(4-methylphenylsulfonyl)spiro[1H-indene-1,4'-(h...)
Affinity DataIC50:  1.00E+5nM. Assay description: Half-maximal inhibition of binding of [3H]- vasopressin to the vasopressin receptor 2 in rat kidney
In DepthDetails ArticlePubMed
TargetOxytocin receptor(RAT)
Drugmoldesign
Curated by ChEMBL
LigandPNGBDBM50001405(1'-(4-methylphenylsulfonyl)spiro[1H-indene-1,4'-(h...)
Affinity DataIC50:  4.00E+3nM. Assay description: Half-maximal inhibition of binding of [3H]-Oxytocin to OT receptor in rat uterine tissue
In DepthDetails ArticlePubMed