BDBM50001437 3-Amino-N-[1-(1-{1-[({1-[(1-carbamoyl-2-phenyl-ethylamino)-methyl]-3-methyl-butylcarbamoyl}-methyl)-carbamoyl]-2-methyl-propylcarbamoyl}-2-phenyl-ethylcarbamoyl)-2-hydroxy-ethyl]-succinamic acid::CHEMBL340743
SMILES CC(C)C[C@@H](CN[C@@H](Cc1ccccc1)C(N)=O)NC(=O)CNC(=O)[C@@H](NC(=O)[C@H](Cc1ccccc1)NC(=O)[C@H](CO)NC(=O)[C@@H](N)CC(O)=O)C(C)C
InChI Key InChIKey=ZJTJPPYYVAPJID-HLYNNXGTSA-N
Data  1 IC50
  Tab Delimited (TSV)   2D SDfile   Computed 3D by Vconf -m prep SDfile
Find this compound or compounds like it in BindingDB:
Activity Spreadsheet -- Enzyme Inhibition Constant Data from BindingDB
Found 1 hit for monomerid = 50001437
TargetSubstance-K receptor(HAMSTER)
Marion Merrell Dow Research Institute
Curated by ChEMBL
LigandPNGBDBM50001437(3-Amino-N-[1-(1-{1-[({1-[(1-carbamoyl-2-phenyl-eth...)
Affinity DataIC50:  9nM. Assay description: Competitive inhibition of [125I]NKA binding to hamster urinary bladder Tachykinin receptor 2
In DepthDetails ArticlePubMed