BDBM50001446 3-Amino-N-(1-{1-benzyl-2-[1-({[1-(1-carbamoyl-3-methyl-butylcarbamoyl)-3-methyl-butylcarbamoyl]-methyl}-carbamoyl)-2-methyl-propylamino]-ethylcarbamoyl}-2-hydroxy-ethyl)-succinamic acid::CHEMBL128175
SMILES CC(C)C[C@H](NC(=O)[C@H](CC(C)C)NC(=O)CNC(=O)[C@@H](NC[C@H](Cc1ccccc1)NC(=O)[C@H](CO)NC(=O)[C@@H](N)CC(O)=O)C(C)C)C(N)=O
InChI Key InChIKey=LKKVBBKSWJHIPS-CJQGIMJOSA-N
Data  1 IC50
  Tab Delimited (TSV)   2D SDfile   Computed 3D by Vconf -m prep SDfile
Find this compound or compounds like it in BindingDB:
Activity Spreadsheet -- Enzyme Inhibition Constant Data from BindingDB
Found 1 hit for monomerid = 50001446
TargetSubstance-K receptor(HAMSTER)
Marion Merrell Dow Research Institute
Curated by ChEMBL
LigandPNGBDBM50001446(3-Amino-N-(1-{1-benzyl-2-[1-({[1-(1-carbamoyl-3-me...)
Affinity DataIC50: >1.00E+4nM. Assay description: Competitive inhibition of [125I]NKA binding to hamster urinary bladder Tachykinin receptor 2
In DepthDetails ArticlePubMed