BDBM50001551 22-cyclopropylmethyl-9-isothiocyanato-14-oxa-11,22-diazaheptacyclo[13.9.1.01,13.02,21.04,12.05,10.019,25]pentacosa-4(12),5(10),6,8,15,17,19(25)-heptaene-2,16-diol::CHEMBL129897
SMILES Oc1ccc2CC3N(CC4CC4)CCC45C(Oc1c24)c1[nH]c2c(cccc2c1CC35O)N=C=S
InChI Key InChIKey=STOXPPZNSYPOHZ-UHFFFAOYSA-N
Data  3 Kd
  Tab Delimited (TSV)   2D SDfile   Computed 3D by Vconf -m prep SDfile
Find this compound or compounds like it in BindingDB:
Activity Spreadsheet -- Enzyme Inhibition Constant Data from BindingDB
Found 3 hits for monomerid = 50001551
TargetDelta-type opioid receptor(Rattus norvegicus (rat))
University Of Minnesota
Curated by ChEMBL
LigandPNGBDBM50001551(22-cyclopropylmethyl-9-isothiocyanato-14-oxa-11,22...)
Affinity DataKd:  61nM. Assay description: Compound was evaluated for its effect towards [3H]-DSLET binding to Opioid receptor delta 2 at 4 nM concentration
In DepthDetails ArticlePubMed
TargetDelta-type opioid receptor(Rattus norvegicus (rat))
University Of Minnesota
Curated by ChEMBL
LigandPNGBDBM50001551(22-cyclopropylmethyl-9-isothiocyanato-14-oxa-11,22...)
Affinity DataKd:  2.30nM. Assay description: Compound was evaluated for its effect towards [3H]-DSLET binding to Opioid receptor delta 2 at 4 nM concentration
In DepthDetails ArticlePubMed
TargetDelta-type opioid receptor(Rattus norvegicus (rat))
University Of Minnesota
Curated by ChEMBL
LigandPNGBDBM50001551(22-cyclopropylmethyl-9-isothiocyanato-14-oxa-11,22...)
Affinity DataKd:  16nM. Assay description: Compound was evaluated for its effect towards [3H]-DPDPE binding to Opioid receptor delta 1 at 4 nM concentration expressed as dissociation constant
In DepthDetails ArticlePubMed