BDBM50001722 3-[2-{2-[2-Amino-3-(4-hydroxy-phenyl)-propionylamino]-propionylamino}-3-(4-bromo-phenyl)-propionylamino]-N-{1-[1-(carbamoylmethyl-carbamoyl)-2-methyl-propylcarbamoyl]-2-methyl-propyl}-succinamic acid::CHEMBL139885
SMILES CC(C)[C@H](NC(=O)[C@@H](NC(=O)[C@H](CC(O)=O)NC(=O)[C@H](Cc1ccc(Br)cc1)NC(=O)[C@@H](C)NC(=O)[C@@H](N)Cc1ccc(O)cc1)C(C)C)C(=O)NCC(N)=O
InChI Key InChIKey=ZWXYERPBCJXUDS-GPZFAZAFSA-N
Data  2 KI
  Tab Delimited (TSV)   2D SDfile   Computed 3D by Vconf -m prep SDfile
Find this compound or compounds like it in BindingDB:
Activity Spreadsheet -- Enzyme Inhibition Constant Data from BindingDB
Found 2 hits for monomerid = 50001722
TargetDelta-type opioid receptor(Rattus norvegicus (rat))
University Of Ferrara
Curated by ChEMBL
LigandPNGBDBM50001722(3-[2-{2-[2-Amino-3-(4-hydroxy-phenyl)-propionylami...)
Affinity DataKi:  2.40nM. Assay description: Binding affinity against opioid receptor delta in rats by displacing [3H]-DPDPE
In DepthDetails ArticlePubMed
TargetMu-type opioid receptor(Rattus norvegicus (rat))
University Of Ferrara
Curated by ChEMBL
LigandPNGBDBM50001722(3-[2-{2-[2-Amino-3-(4-hydroxy-phenyl)-propionylami...)
Affinity DataKi:  4.79E+3nM. Assay description: Binding affinity against opioid receptor mu in rats by displacing [3H]-DAGO
In DepthDetails ArticlePubMed