BDBM50001992 1-(4-{4-[5-Chloro-1-(4-fluoro-phenyl)-1H-indol-3-yl]-piperidin-1-yl}-butyl)-imidazolidin-2-one::CHEMBL274648
SMILES Fc1ccc(cc1)-n1cc(C2CCN(CCCCN3CCNC3=O)CC2)c2cc(Cl)ccc12
InChI Key InChIKey=LILXYDLYNDJABW-UHFFFAOYSA-N
Data  2 IC50
  Tab Delimited (TSV)   2D SDfile   Computed 3D by Vconf -m prep SDfile
Find this compound or compounds like it in BindingDB:
Activity Spreadsheet -- Enzyme Inhibition Constant Data from BindingDB
Found 2 hits for monomerid = 50001992
TargetSerotonin 2 (5-HT2) receptor(RAT)
H. Lundbeck
Curated by ChEMBL
LigandPNGBDBM50001992(1-(4-{4-[5-Chloro-1-(4-fluoro-phenyl)-1H-indol-3-y...)
Affinity DataIC50:  59nM. Assay description: Inhibition of [3H]ketanserin binding to rat 5-hydroxytryptamine 2 receptors.
In DepthDetails ArticlePubMed
TargetD(2) dopamine receptor(Rattus norvegicus (rat))
H. Lundbeck
Curated by ChEMBL
LigandPNGBDBM50001992(1-(4-{4-[5-Chloro-1-(4-fluoro-phenyl)-1H-indol-3-y...)
Affinity DataIC50:  78nM. Assay description: Tested for the inhibition of [3H]-spiperone binding to dopamine D2 receptor
In DepthDetails ArticlePubMed