BDBM50002002 1-(2-{4-[5-Chloro-1-(4-fluoro-phenyl)-1H-indol-3-yl]-3,6-dihydro-2H-pyridin-1-yl}-ethyl)-imidazolidin-2-one::CHEMBL12186
SMILES Fc1ccc(cc1)-n1cc(C2=CCN(CCN3CCNC3=O)CC2)c2cc(Cl)ccc12
InChI Key InChIKey=PFOLMILRZUSKJO-UHFFFAOYSA-N
Data  3 IC50
  Tab Delimited (TSV)   2D SDfile   Computed 3D by Vconf -m prep SDfile
Find this compound or compounds like it in BindingDB:
Activity Spreadsheet -- Enzyme Inhibition Constant Data from BindingDB
Found 3 hits for monomerid = 50002002
TargetPotassium voltage-gated channel subfamily H member 2(Homo sapiens (Human))
Tcg Lifesciences
Curated by ChEMBL
LigandPNGBDBM50002002(1-(2-{4-[5-Chloro-1-(4-fluoro-phenyl)-1H-indol-3-y...)
Affinity DataIC50:  10nM. Assay description: Inhibition of human ERG
In DepthDetails ArticlePubMed
TargetPotassium voltage-gated channel subfamily H member 2(Homo sapiens (Human))
Tcg Lifesciences
Curated by ChEMBL
LigandPNGBDBM50002002(1-(2-{4-[5-Chloro-1-(4-fluoro-phenyl)-1H-indol-3-y...)
Affinity DataIC50:  10nM. Assay description: Inhibition of K+ channel activity in CHO cells expressing HERG Kv11.1
In DepthDetails ArticlePubMed
TargetD(2) dopamine receptor(Rattus norvegicus (rat))
H. Lundbeck
Curated by ChEMBL
LigandPNGBDBM50002002(1-(2-{4-[5-Chloro-1-(4-fluoro-phenyl)-1H-indol-3-y...)
Affinity DataIC50:  2.30nM. Assay description: Tested for the inhibition of [3H]-spiperone binding to dopamine D2 receptor
In DepthDetails ArticlePubMed