BDBM50002101 11-(2-Dimethylamino-ethylidene)-6,11-dihydro-dibenzo[b,e]oxepine-2-carboxylic acid; compound with but-2-enedioic acid::CHEMBL63424
SMILES CN(C)C\C=C1/c2ccccc2COc2ccc(cc12)C(O)=O
InChI Key InChIKey=XDUKFMIZVPBPFK-CXUHLZMHSA-N
Data  1 KI
  Tab Delimited (TSV)   2D SDfile   Computed 3D by Vconf -m prep SDfile
Find this compound or compounds like it in BindingDB:
Activity Spreadsheet -- Enzyme Inhibition Constant Data from BindingDB
Found 1 hit for monomerid = 50002101
TargetHistamine H1 receptor(Cavia porcellus (domestic guinea pig))
Kyowa Hakko Kogyo
Curated by ChEMBL
LigandPNGBDBM50002101(11-(2-Dimethylamino-ethylidene)-6,11-dihydro-diben...)
Affinity DataKi:  12nM. Assay description: Binding affinity for histamine H1 receptor from guinea pig cerebellum, using [3H]pyrilamine as radioligand at 0.1 uM
In DepthDetails ArticlePubMed