BDBM50002240 1-Cyclopropylmethyl-4-(naphthalen-2-yloxymethyl)-piperidine;0.2hydrate::CHEMBL139578
SMILES C(Oc1ccc2ccccc2c1)C1CCN(CC2CC2)CC1
InChI Key InChIKey=ANPCCLIAGPFBDJ-UHFFFAOYSA-N
Data  2 KI  1 IC50
  Tab Delimited (TSV)   2D SDfile   Computed 3D by Vconf -m prep SDfile
Find this compound or compounds like it in BindingDB:
Activity Spreadsheet -- Enzyme Inhibition Constant Data from BindingDB
Found 3 hits for monomerid = 50002240
TargetSigma non-opioid intracellular receptor 1(Mus musculus (Mouse))
Dupont Pharmaceuticals
Curated by ChEMBL
LigandPNGBDBM50002240(1-Cyclopropylmethyl-4-(naphthalen-2-yloxymethyl)-p...)
Affinity DataKi:  5nM. Assay description: In vitro binding affinity for the mouse sigma opioid receptor
In DepthDetails ArticlePubMed
Target5-hydroxytryptamine receptor 2A/2B/2C(Mus musculus (Mouse))
Dupont Pharmaceuticals
Curated by ChEMBL
LigandPNGBDBM50002240(1-Cyclopropylmethyl-4-(naphthalen-2-yloxymethyl)-p...)
Affinity DataKi: >100nM. Assay description: In vitro binding affinity for serotonin 5-hydroxytryptamine (5-HT) 2 receptors
In DepthDetails ArticlePubMed
TargetD(2) dopamine receptor(Mus musculus (Mouse))
Dupont Pharmaceuticals
Curated by ChEMBL
LigandPNGBDBM50002240(1-Cyclopropylmethyl-4-(naphthalen-2-yloxymethyl)-p...)
Affinity DataIC50:  2.96E+3nM. Assay description: In vitro binding affinity towards dopamine receptor D2
In DepthDetails ArticlePubMed