BDBM50002544 CHEMBL294288::benzyl 2-[1-[3-carbamoyl-1-neopentylcarboxamido-(1S)-propylcarboxamido]-2-(1-formyl-1H-3-indolyl)-(1R)-ethylcarboxamido]-4-methyl-(2S)-pentanoate
SMILES CC(C)C[C@H](NC(=O)[C@@H](Cc1cn(C=O)c2ccccc12)NC(=O)[C@H](CCC(N)=O)NC(=O)OC(C)(C)C)C(=O)OCc1ccccc1
InChI Key InChIKey=CLDDZHIEZFRINB-IARZGTGTSA-N
Data  1 IC50
  Tab Delimited (TSV)   2D SDfile   Computed 3D by Vconf -m prep SDfile
Find this compound or compounds like it in BindingDB:
Activity Spreadsheet -- Enzyme Inhibition Constant Data from BindingDB
Found 1 hit for monomerid = 50002544
TargetSubstance-P receptor(GUINEA PIG)
Fujisawa Pharmaceutical
Curated by ChEMBL
LigandPNGBDBM50002544(CHEMBL294288 | benzyl 2-[1-[3-carbamoyl-1-neopenty...)
Affinity DataIC50:  1.00E+4nM. Assay description: Displacement of specific binding of [3H]SP to tachykinin receptor 1 from the isolated guinea pig tracheal strips
In DepthDetails ArticlePubMed