BDBM50002546 4-carbamoyl-2-[3-carbamoyl-1-[(5R)-dihydro-1H-5-pyrrolylcarboxamido]-(1S)-propylcarboxamido]-(2S)-butanoic acid::CHEMBL293459
SMILES NC(=O)CC[C@H](NC(=O)[C@H](CCC(N)=O)NC(=O)[C@H]1CCCN1)C(O)=O
InChI Key InChIKey=FISHYTLIMUYTQY-UTLUCORTSA-N
Data  1 IC50
  Tab Delimited (TSV)   2D SDfile   Computed 3D by Vconf -m prep SDfile
Find this compound or compounds like it in BindingDB:
Activity Spreadsheet -- Enzyme Inhibition Constant Data from BindingDB
Found 1 hit for monomerid = 50002546
TargetSubstance-P receptor(GUINEA PIG)
Fujisawa Pharmaceutical
Curated by ChEMBL
LigandPNGBDBM50002546(4-carbamoyl-2-[3-carbamoyl-1-[(5R)-dihydro-1H-5-py...)
Affinity DataIC50: >1.00E+5nM. Assay description: Displacement of specific binding of [3H]SP to tachykinin receptor 1 from the isolated guinea pig tracheal strips
In DepthDetails ArticlePubMed