BDBM50002846 CHEMBL3233938
SMILES COc1cc2c(O)c(C(=O)NCC3CCN(Cc4ccccc4)CC3)c(=O)n(Cc3ccccc3)c2cc1OC
InChI Key InChIKey=WORHDPUHGADSMT-UHFFFAOYSA-N
Data  2 IC50
  Tab Delimited (TSV)   2D SDfile   Computed 3D by Vconf -m prep SDfile
Find this compound or compounds like it in BindingDB:
Activity Spreadsheet -- Enzyme Inhibition Constant Data from BindingDB
Found 2 hits for monomerid = 50002846
TargetCholinesterase(Equus caballus (Horse))
Universit£
Curated by ChEMBL
LigandPNGBDBM50002846(CHEMBL3233938)
Affinity DataIC50: >6.00E+4nM. Assay description: Inhibition of BuChE in equine serum using butyrylthiocholine iodide as substrate preincubated with enzyme for 10 mins prior to substrate challenge me...
In DepthDetails ArticlePubMed
TargetAcetylcholinesterase(Electrophorus electricus (Electric eel))
Universit£
Curated by ChEMBL
LigandPNGBDBM50002846(CHEMBL3233938)
Affinity DataIC50:  270nM. Assay description: Inhibition of electric eel AChE using acetylthiocholine iodide as substrate preincubated with enzyme for 10 mins prior to substrate challenge measure...
In DepthDetails ArticlePubMed