BDBM50002940 CHEMBL237097
SMILES CCCCN(CCCC)CCCNC(=O)[C@@H](Cc1ccccc1)NC(=O)C1(CCCCC1)NC(=O)c1cc2ccccc2s1
InChI Key InChIKey=FHBFYBOSRIQZHG-SSEXGKCCSA-N
Data  2 KI
  Tab Delimited (TSV)   2D SDfile   Computed 3D by Vconf -m prep SDfile
Find this compound or compounds like it in BindingDB:
Activity Spreadsheet -- Enzyme Inhibition Constant Data from BindingDB
Found 2 hits for monomerid = 50002940
TargetSubstance-K receptor(Homo sapiens (Human))
Menarini Ricerche
Curated by ChEMBL
LigandPNGBDBM50002940(CHEMBL237097)
Affinity DataKi:  1.30nM. Assay description: Displacement of [125I]NKA from human NK2 expressed in CHO-K1 cellsChecked by Author
In DepthDetails ArticlePubMed
TargetSubstance-K receptor(GUINEA PIG)
Menarini Ricerche
Curated by ChEMBL
LigandPNGBDBM50002940(CHEMBL237097)
Affinity DataKi:  200nM. Assay description: Agonist activity at NK2 receptor in guinea pig smooth muscleChecked by Author
In DepthDetails ArticlePubMed