BDBM50002974 4-Amino-piperidine-1-carboxylic acid 1-[1-[1-cyclohexylmethyl-2-hydroxy-4-(pyridin-2-ylsulfanyl)-butylcarbamoyl]-2-(1H-imidazol-4-yl)-ethylcarbamoyl]-2-phenyl-ethyl ester::CHEMBL118421
SMILES NC1CCN(CC1)C(=O)O[C@@H](Cc1ccccc1)C(=O)N[C@@H](Cc1cnc[nH]1)C(=O)N[C@@H](CC1CCCCC1)[C@@H](O)CCSc1ccccn1
InChI Key InChIKey=OZFZEVAJUHXLRM-YRCZKMHPSA-N
Data  3 IC50
  Tab Delimited (TSV)   2D SDfile   Computed 3D by Vconf -m prep SDfile
Find this compound or compounds like it in BindingDB:
Activity Spreadsheet -- Enzyme Inhibition Constant Data from BindingDB
Found 3 hits for monomerid = 50002974
TargetRenin(Homo sapiens (Human))
E. Merck Darmstadt
Curated by ChEMBL
LigandPNGBDBM50002974(4-Amino-piperidine-1-carboxylic acid 1-[1-[1-cyclo...)
Affinity DataIC50:  33nMpH: 5.5Assay Description:In vitro inhibitory activity against human plasma renin at pH 5.5 for suppression of angiotensin I formation.
In DepthDetails ArticlePubMed
TargetCathepsin D(Bos taurus)
E. Merck Darmstadt
Curated by ChEMBL
LigandPNGBDBM50002974(4-Amino-piperidine-1-carboxylic acid 1-[1-[1-cyclo...)
Affinity DataIC50: >1.00E+4nM. Assay description: In vitro inhibitory activity was measured on bovine cathepsin D
In DepthDetails ArticlePubMed
TargetPepsin A(Porcine)
E. Merck Darmstadt
Curated by ChEMBL
LigandPNGBDBM50002974(4-Amino-piperidine-1-carboxylic acid 1-[1-[1-cyclo...)
Affinity DataIC50: >1.00E+4nM. Assay description: In vitro inhibitory activity was measured on porcine pepsin.
In DepthDetails ArticlePubMed