BDBM50003131 3-Ethyl-5-nonyl-4,5-dihydro-3H-[3,4']bipyridinyl-2,6-dione::CHEMBL123494
SMILES CCCCCCCCC[C@H]1C[C@@](CC)(C(=O)NC1=O)c1ccncc1
InChI Key InChIKey=GEPKJZBJJMEZOA-LAUBAEHRSA-N
Data  1 IC50
  Tab Delimited (TSV)   2D SDfile   Computed 3D by Vconf -m prep SDfile
Find this compound or compounds like it in BindingDB:
Activity Spreadsheet -- Enzyme Inhibition Constant Data from BindingDB
Found 1 hit for monomerid = 50003131
TargetAromatase(Homo sapiens (Human))
Institute Of Cancer Research
Curated by ChEMBL
LigandPNGBDBM50003131(3-Ethyl-5-nonyl-4,5-dihydro-3H-[3,4']bipyridinyl-2...)
Affinity DataIC50:  4.10E+3nM. Assay description: Inhibition of Cytochrome P450 19A1
In DepthDetails ArticlePubMed