BDBM50003143 Butyl-methyl-prop-2-ynyl-amine; hydrochloride::CHEMBL538279
SMILES CCCCN(C)CC#C
InChI Key InChIKey=NJBSAFGMLJQVNT-UHFFFAOYSA-N
Data  2 IC50
  Tab Delimited (TSV)   2D SDfile   Computed 3D by Vconf -m prep SDfile
Find this compound or compounds like it in BindingDB:
Activity Spreadsheet -- Enzyme Inhibition Constant Data from BindingDB
Found 2 hits for monomerid = 50003143
TargetAmine oxidase [flavin-containing] A(Rattus norvegicus (rat))
University Of Saskatchewan
Curated by ChEMBL
LigandPNGBDBM50003143(Butyl-methyl-prop-2-ynyl-amine; hydrochloride | CH...)
Affinity DataIC50:  9.80E+4nM. Assay description: Inhibition of Monoamine oxidase A of rat liver mitochondrial membranes
In DepthDetails ArticlePubMed
TargetAmine oxidase [flavin-containing] B(Rattus norvegicus (rat))
University Of Saskatchewan
Curated by ChEMBL
LigandPNGBDBM50003143(Butyl-methyl-prop-2-ynyl-amine; hydrochloride | CH...)
Affinity DataIC50:  1.40E+3nM. Assay description: Inhibition of Monoamine oxidase B of rat liver mitochondrial membranes
In DepthDetails ArticlePubMed