BDBM50003170 (6-Cyclohexylmethyl-7-hydroxy-10-morpholin-4-ylmethyl-4,8,14-trioxo-1,9-dioxa-5-aza-cyclotetradec-3-yl)-carbamic acid benzyl ester::CHEMBL126046
SMILES O[C@@H]1[C@H](CC2CCCCC2)NC(=O)[C@H](COC(=O)CCC[C@H](CN2CCOCC2)OC1=O)NC(=O)OCc1ccccc1
InChI Key InChIKey=RMNNILASEWTICU-ARXPIFDKSA-N
Data  1 IC50
  Tab Delimited (TSV)   2D SDfile   Computed 3D by Vconf -m prep SDfile
Find this compound or compounds like it in BindingDB:
Activity Spreadsheet -- Enzyme Inhibition Constant Data from BindingDB
Found 1 hit for monomerid = 50003170
TargetRenin(Homo sapiens (Human))
Merck Research Laboratories
Curated by ChEMBL
LigandPNGBDBM50003170((6-Cyclohexylmethyl-7-hydroxy-10-morpholin-4-ylmet...)
Affinity DataIC50:  230nMpH: 7.4Assay Description:Inhibitory activity against human renin inhibition (at pH 7.4)
In DepthDetails ArticlePubMed