BDBM50003241 2,2-Dimethyl-butyric acid 8-[2-(4-hydroxy-6-oxo-tetrahydro-pyran-2-yl)-ethyl]-2-(hydroxy-phenyl-methyl)-3,7-dimethyl-1,2,3,7,8,8a-hexahydro-naphthalen-1-yl ester::CHEMBL3349825
SMILES [H][C@](O)(c1ccccc1)[C@]1([H])[C@@H](C)C=C2C=C[C@H](C)[C@H](CC[C@@H]3C[C@@H](O)CC(=O)O3)C2[C@H]1OC(=O)C(C)(C)CC
InChI Key InChIKey=PHXNCOYBROLLOS-PELIINNNSA-N
Data  1 IC50
  Tab Delimited (TSV)   2D SDfile   Computed 3D by Vconf -m prep SDfile
Find this compound or compounds like it in BindingDB:
Activity Spreadsheet -- Enzyme Inhibition Constant Data from BindingDB
Found 1 hit for monomerid = 50003241
Target3-hydroxy-3-methylglutaryl-coenzyme A reductase(Homo sapiens (Human))
Merck Research Laboratories
Curated by ChEMBL
LigandPNGBDBM50003241(2,2-Dimethyl-butyric acid 8-[2-(4-hydroxy-6-oxo-te...)
Affinity DataIC50:  20nM. Assay description: The compound was tested in vitro for inhibitory activity against HMG-CoA reductase
In DepthDetails ArticlePubMed