BDBM50003254 3-[2-Butyl-3-(2-chloro-benzyl)-3H-imidazol-4-yl]-2-(3-phenoxy-benzyl)-acrylic acid::CHEMBL128032
SMILES CCCCc1ncc(\C=C(/Cc2cccc(Oc3ccccc3)c2)C(O)=O)n1Cc1ccccc1Cl
InChI Key InChIKey=WEVNTHMLXUOYGL-LYBHJNIJSA-N
Data  1 IC50
  Tab Delimited (TSV)   2D SDfile   Computed 3D by Vconf -m prep SDfile
Find this compound or compounds like it in BindingDB:
Activity Spreadsheet -- Enzyme Inhibition Constant Data from BindingDB
Found 1 hit for monomerid = 50003254
TargetType-1 angiotensin II receptor B(RAT)
Smithkline Beecham Pharmaceuticals
Curated by ChEMBL
LigandPNGBDBM50003254(3-[2-Butyl-3-(2-chloro-benzyl)-3H-imidazol-4-yl]-2...)
Affinity DataIC50:  1.00E+4nM. Assay description: Compound was evaluated for the inhibition of [125I]-AII specific binding to rat mesenteric arteries
In DepthDetails ArticlePubMed