BDBM50003268 CHEMBL407502
SMILES CCNC(=O)[C@H]1O[C@H]([C@H](O)[C@@H]1O)n1cnc2c(NC)ncnc12
InChI Key InChIKey=XGPNUJPPWHGSPB-QRIDJOKKSA-N
Data  1 EC50
  Tab Delimited (TSV)   2D SDfile   Computed 3D by Vconf -m prep SDfile
Find this compound or compounds like it in BindingDB:
Activity Spreadsheet -- Enzyme Inhibition Constant Data from BindingDB
Found 1 hit for monomerid = 50003268
TargetAdenosine receptor A2b(Homo sapiens (Human))
National Institute Of Diabetes And Digestive And Kidney Diseases
Curated by ChEMBL
LigandPNGBDBM50003268(CHEMBL407502)
Affinity DataEC50:  4.17E+4nM. Assay description: Agonist activity at human adenosine A2B receptor expressed in CHO cells assessed as stimulation of adenylate cyclase
In DepthDetails ArticlePubMed