BDBM50003434 1-(4-Benzyloxy-phenyl)-3-(hydroxy-methyl-amino)-2-methyl-propenone::CHEMBL130329
SMILES CN(O)\C=C(\C)C(=O)c1ccc(OCc2ccccc2)cc1
InChI Key InChIKey=VOQPQTCXPBXJFA-OWBHPGMISA-N
Data  1 IC50
  Tab Delimited (TSV)   2D SDfile   Computed 3D by Vconf -m prep SDfile
Find this compound or compounds like it in BindingDB:
Activity Spreadsheet -- Enzyme Inhibition Constant Data from BindingDB
Found 1 hit for monomerid = 50003434
TargetPolyunsaturated fatty acid 5-lipoxygenase(Rattus norvegicus)
Dupont Pharmaceuticals
Curated by ChEMBL
LigandPNGBDBM50003434(1-(4-Benzyloxy-phenyl)-3-(hydroxy-methyl-amino)-2-...)
Affinity DataIC50:  8.90E+3nM. Assay description: inhibitory activity against 5-lipoxygenase in rat basophilic leukemia cell line.
In DepthDetails ArticlePubMed