BDBM50003515 2,2-Diphenyl-1-(4-pyridin-3-ylmethyl-piperazin-1-yl)-ethanone::CHEMBL133586
SMILES O=C(C(c1ccccc1)c1ccccc1)N1CCN(Cc2cccnc2)CC1
InChI Key InChIKey=OOSTYSLVBIYRQX-UHFFFAOYSA-N
Data  1 IC50
  Tab Delimited (TSV)   2D SDfile   Computed 3D by Vconf -m prep SDfile
Find this compound or compounds like it in BindingDB:
Activity Spreadsheet -- Enzyme Inhibition Constant Data from BindingDB
Found 1 hit for monomerid = 50003515
TargetPlatelet-activating factor receptor(Cavia porcellus)
J. Uriach & C£A.S.A.
Curated by ChEMBL
LigandPNGBDBM50003515(2,2-Diphenyl-1-(4-pyridin-3-ylmethyl-piperazin-1-y...)
Affinity DataIC50:  2.60E+3nM. Assay description: Concentration tested in vitro to inhibit PAF-induced maximum aggregation (PAF-Antagonistic activity) by 50%.
In DepthDetails ArticlePubMed