BDBM50003523 CHEMBL544607::[4-(2-Dibenzylamino-acetyl)-piperazin-1-yl]-pyridin-3-yl-acetonitrile; trihydrochloride; hydrate
SMILES O=C(CN(Cc1ccccc1)Cc1ccccc1)N1CCN(CC1)C(C#N)c1cccnc1
InChI Key InChIKey=IPEYBAPKPJSTRQ-UHFFFAOYSA-N
Data  1 IC50
  Tab Delimited (TSV)   2D SDfile   Computed 3D by Vconf -m prep SDfile
Find this compound or compounds like it in BindingDB:
Activity Spreadsheet -- Enzyme Inhibition Constant Data from BindingDB
Found 1 hit for monomerid = 50003523
TargetPlatelet-activating factor receptor(Cavia porcellus)
J. Uriach & C£A.S.A.
Curated by ChEMBL
LigandPNGBDBM50003523(CHEMBL544607 | [4-(2-Dibenzylamino-acetyl)-piperaz...)
Affinity DataIC50:  32nM. Assay description: Concentration tested in vitro to inhibit PAF-induced maximum aggregation (PAF-Antagonistic activity) by 50%.
In DepthDetails ArticlePubMed