BDBM50003669 Ac-Tyr(SO3H)-Met-Gly-Trp-Met-R-Dtc-Phe-NH2::CHEMBL411079
SMILES CSCC[C@H](NC(=O)[C@H](Cc1ccc(cc1)S(O)(=O)=O)NC(C)=O)C(=O)NCC(=O)N[C@@H](Cc1c[nH]c2ccccc12)C(=O)N[C@@H](CCSC)C(=O)N1CSC(C)(C)[C@@H]1C(=O)N[C@@H](Cc1ccccc1)C(N)=O
InChI Key InChIKey=LLFOCGPJVJUFGJ-JWWLOPLXSA-N
Data  2 IC50
  Tab Delimited (TSV)   2D SDfile   Computed 3D by Vconf -m prep SDfile
Find this compound or compounds like it in BindingDB:
Activity Spreadsheet -- Enzyme Inhibition Constant Data from BindingDB
Found 2 hits for monomerid = 50003669
TargetGastrin/cholecystokinin type B receptor(Bos taurus)
Roche Research Center
Curated by ChEMBL
LigandPNGBDBM50003669(Ac-Tyr(SO3H)-Met-Gly-Trp-Met-R-Dtc-Phe-NH2 | CHEMB...)
Affinity DataIC50:  2.31E+3nM. Assay description: Concentration inhibiting [3H]-propanoyl-CCK-8 binding to cholecystokinin type B receptor of bovine striatum.
In DepthDetails ArticlePubMed
TargetCholecystokinin receptor type A(RAT)
Roche Research Center
Curated by ChEMBL
LigandPNGBDBM50003669(Ac-Tyr(SO3H)-Met-Gly-Trp-Met-R-Dtc-Phe-NH2 | CHEMB...)
Affinity DataIC50:  0.0500nM. Assay description: Concentration inhibiting [3H]-propanoyl-CCK-8 binding to cholecystokinin type A receptor of rat pancreatic membranes.
In DepthDetails ArticlePubMed