BDBM50003741 CHEMBL137269::N-[4-(2-Iodomethylene-6-oxo-tetrahydro-pyran-4-yl)-phenyl]-guanidine
SMILES [#7]\[#6](-[#7])=[#7]\c1ccc(cc1)-[#6]-1-[#6]-[#6](=O)-[#8]\[#6](-[#6]-1)=[#6]/I
InChI Key InChIKey=COQHRXZDELUWKF-XFFZJAGNSA-N
Data  2 KI  1 Koff
  Tab Delimited (TSV)   2D SDfile   Computed 3D by Vconf -m prep SDfile
Find this compound or compounds like it in BindingDB:
Activity Spreadsheet -- Enzyme Inhibition Constant Data from BindingDB
Found 3 hits for monomerid = 50003741
TargetSerine protease 1(Bos taurus (bovine))
University Of Illinois
Curated by ChEMBL
LigandPNGBDBM50003741(CHEMBL137269 | N-[4-(2-Iodomethylene-6-oxo-tetrahy...)
Affinity DataKi:  4.28E+3nM. Assay description: Compound was tested for its binding affinity against the enzyme trypsin
In DepthDetails ArticlePubMed
TargetUrokinase-type plasminogen activator(Homo sapiens (Human))
University Of Illinois
Curated by ChEMBL
LigandPNGBDBM50003741(CHEMBL137269 | N-[4-(2-Iodomethylene-6-oxo-tetrahy...)
Affinity DataKi:  7.83E+3nM. Assay description: Compound was tested for its binding affinity against the enzyme Urokinase-type plasminogen activator
In DepthDetails ArticlePubMed
TargetSerine protease 1(Bos taurus (bovine))
University Of Illinois
Curated by ChEMBL
LigandPNGBDBM50003741(CHEMBL137269 | N-[4-(2-Iodomethylene-6-oxo-tetrahy...)
Affinity DataKon:  0.000330M-1s-1Assay Description:Compound was tested for its binding affinity against the enzyme trypsin
In DepthDetails ArticlePubMed