BDBM50003846 2-(4,5-Diphenyl-1H-imidazol-2-ylsulfanylmethyl)-6-methoxy-4-methyl-tetrahydro-pyran-4-ol::CHEMBL442025
SMILES CO[C@@H]1C[C@@](C)(O)C[C@H](CSc2nc(c([nH]2)-c2ccccc2)-c2ccccc2)O1
InChI Key InChIKey=JNJRDSMXUNXNRZ-MSYCTHLASA-N
Data  1 IC50
  Tab Delimited (TSV)   2D SDfile   Computed 3D by Vconf -m prep SDfile
Find this compound or compounds like it in BindingDB:
Activity Spreadsheet -- Enzyme Inhibition Constant Data from BindingDB
Found 1 hit for monomerid = 50003846
TargetSterol O-acyltransferase 1(Rattus norvegicus)
Rhone-Poulenc Rorer
Curated by ChEMBL
LigandPNGBDBM50003846(2-(4,5-Diphenyl-1H-imidazol-2-ylsulfanylmethyl)-6-...)
Affinity DataIC50:  82nM. Assay description: Inhibition of acyl coenzyme A:cholesterol acyltransferase (ACAT) activity in rat liver microsome
In DepthDetails ArticlePubMed