BDBM50004501 (E)-(R)-O-(2-Dec-3-enamidoisohexyl) phosphocholine::CHEMBL102090
SMILES CCCCC\C=C/CCC(=O)N[C@@H](COP([O-])(=O)OCC[N+](C)(C)C)CC(C)C
InChI Key InChIKey=PNDFEJQLAHUEBI-ZCPJJFRWSA-N
Data  1 IC50
  Tab Delimited (TSV)   2D SDfile   Computed 3D by Vconf -m prep SDfile
Find this compound or compounds like it in BindingDB:
Activity Spreadsheet -- Enzyme Inhibition Constant Data from BindingDB
Found 1 hit for monomerid = 50004501
TargetPhospholipase A2, major isoenzyme(Sus scrofa (pig))
Fisons
Curated by ChEMBL
LigandPNGBDBM50004501((E)-(R)-O-(2-Dec-3-enamidoisohexyl) phosphocholine...)
Affinity DataIC50:  6.00E+3nM. Assay description: In vitro inhibition of porcine pancreatic phospholipase A2 evaluated by monomeric substrate assay
In DepthDetails ArticlePubMed