BDBM50004716 (2R,3R)-2-Methyl-3,7-diphenyl-5-propoxy-2,7-dihydro-3H-imidazo[1,2-c]pyrazolo[4,3-e]pyrimidine::2-Methyl-3,6-diphenyl-4-propoxy-2,6-dihydro-3H-1,3a,5,6,7-pentaaza-as-indacene::CHEMBL111729
SMILES CCCOC1=Nc2c(cnn2-c2ccccc2)C2=N[C@H](C)[C@H](N12)c1ccccc1
InChI Key InChIKey=SWJWVTBKVUVWHZ-UZLBHIALSA-N
Data  4 KI
  Tab Delimited (TSV)   2D SDfile   Computed 3D by Vconf -m prep SDfile
Find this compound or compounds like it in BindingDB:
Activity Spreadsheet -- Enzyme Inhibition Constant Data from BindingDB
Found 4 hits for monomerid = 50004716
TargetAdenosine receptor A1(Rattus norvegicus (rat))
Marion Merrell Dow Research Institute
Curated by ChEMBL
LigandPNGBDBM50004716((2R,3R)-2-Methyl-3,7-diphenyl-5-propoxy-2,7-dihydr...)
Affinity DataKi:  7.40E+3nM. Assay description: Inhibition of [3H]-CHA binding to Adenosine A1 receptor in whole rat brain membranes
In DepthDetails ArticlePubMed
TargetAdenosine receptor A1(Rattus norvegicus (rat))
Marion Merrell Dow Research Institute
Curated by ChEMBL
LigandPNGBDBM50004716((2R,3R)-2-Methyl-3,7-diphenyl-5-propoxy-2,7-dihydr...)
Affinity DataKi:  7.40E+3nM. Assay description: Binding affinity for rat brain Adenosine A1 receptor
In DepthDetails ArticlePubMed
TargetAdenosine receptor A2a(Rattus norvegicus (rat))
Griffith University
Curated by ChEMBL
LigandPNGBDBM50004716((2R,3R)-2-Methyl-3,7-diphenyl-5-propoxy-2,7-dihydr...)
Affinity DataKi:  1.10E+4nM. Assay description: Binding affinity against Adenosine A2a receptor from rat striata
In DepthDetails ArticlePubMed
TargetAdenosine receptor A2a/A2b(Rattus norvegicus)
Marion Merrell Dow Research Institute
Curated by ChEMBL
LigandPNGBDBM50004716((2R,3R)-2-Methyl-3,7-diphenyl-5-propoxy-2,7-dihydr...)
Affinity DataKi:  1.10E+4nM. Assay description: Inhibition of of Bodipy-labelled cyclopamine binding to Smo expressed in COS-1 cells in presence of 20% NHS after 4 to 6 hrs by FACS flow cytometric ...
In DepthDetails ArticlePubMed