BDBM50004722 (R)-8-Benzyl-3-phenyl-5-propoxy-7,8-dihydro-3H-imidazo[2,1-i]purine::7-Benzyl-3-phenyl-5-propoxy-6,7-dihydro-3H-1,3,4,5a,8-pentaaza-as-indacene::CHEMBL109894
SMILES CCCOC1=Nc2c(ncn2-c2ccccc2)C2=N[C@H](Cc3ccccc3)CN12
InChI Key InChIKey=JXRGBAIKUGLKHS-GOSISDBHSA-N
Data  4 KI
  Tab Delimited (TSV)   2D SDfile   Computed 3D by Vconf -m prep SDfile
Find this compound or compounds like it in BindingDB:
Activity Spreadsheet -- Enzyme Inhibition Constant Data from BindingDB
Found 4 hits for monomerid = 50004722
TargetAdenosine receptor A1(Rattus norvegicus (rat))
Griffith University
Curated by ChEMBL
LigandPNGBDBM50004722((R)-8-Benzyl-3-phenyl-5-propoxy-7,8-dihydro-3H-imi...)
Affinity DataKi:  3.20E+3nM. Assay description: Binding affinity for rat brain Adenosine A1 receptor
In DepthDetails ArticlePubMed
TargetAdenosine receptor A1(Rattus norvegicus (rat))
Griffith University
Curated by ChEMBL
LigandPNGBDBM50004722((R)-8-Benzyl-3-phenyl-5-propoxy-7,8-dihydro-3H-imi...)
Affinity DataKi:  3.20E+3nM. Assay description: Inhibition of [3H]-CHA binding to Adenosine A1 receptor in whole rat brain membranes
In DepthDetails ArticlePubMed
TargetAdenosine receptor A2a/A2b(Rattus norvegicus)
Marion Merrell Dow Research Institute
Curated by ChEMBL
LigandPNGBDBM50004722((R)-8-Benzyl-3-phenyl-5-propoxy-7,8-dihydro-3H-imi...)
Affinity DataKi:  7.20E+4nM. Assay description: Inhibition of Shh signaling in mouse Shh-light2 cells by Gli-dependent firefly luciferase reporter gene assay
In DepthDetails ArticlePubMed
TargetAdenosine receptor A2a(Rattus norvegicus (rat))
Griffith University
Curated by ChEMBL
LigandPNGBDBM50004722((R)-8-Benzyl-3-phenyl-5-propoxy-7,8-dihydro-3H-imi...)
Affinity DataKi:  7.20E+4nM. Assay description: Binding affinity against Adenosine A2a receptor from rat striata
In DepthDetails ArticlePubMed