BDBM50005001 7-Chloro-4-hydroxy-quinoline-2-carboxylic acid::7-Chloro-4-hydroxy-quinoline-2-carboxylic acid (7-chloro-kynurenate)::7-Chloro-4-oxo-1,4-dihydro-quinoline-2-carboxylic acid::CHEMBL311389
SMILES OC(=O)c1cc(O)c2ccc(Cl)cc2n1
InChI Key InChIKey=UAWVRVFHMOSAPU-UHFFFAOYSA-N
Data  1 KI
  Tab Delimited (TSV)   2D SDfile   Computed 3D by Vconf -m prep SDfile
Find this compound or compounds like it in BindingDB:
Activity Spreadsheet -- Enzyme Inhibition Constant Data from BindingDB
Found 1 hit for monomerid = 50005001
TargetVesicular glutamate transporter 3(Rattus norvegicus)
The University Of Montana
Curated by ChEMBL
LigandPNGBDBM50005001(7-Chloro-4-hydroxy-quinoline-2-carboxylic acid | 7...)
Affinity DataKi:  5.90E+5nM. Assay description: Evaluated for competitive inhibition against Vesicular glutamate transporter (VGLUT), and Ki value was reported.
In DepthDetails ArticlePubMed