BDBM50005072 5,7-Dichloro-4-(3-p-tolyl-ureido)-1,2,3,4-tetrahydro-quinoline-2-carboxylic acid::CHEMBL61153
SMILES Cc1ccc(NC(=O)N[C@H]2C[C@@H](Nc3cc(Cl)cc(Cl)c23)C(O)=O)cc1
InChI Key InChIKey=SPFYQISIAZRTPO-LSDHHAIUSA-N
Data  1 IC50
  Tab Delimited (TSV)   2D SDfile   Computed 3D by Vconf -m prep SDfile
Find this compound or compounds like it in BindingDB:
Activity Spreadsheet -- Enzyme Inhibition Constant Data from BindingDB
Found 1 hit for monomerid = 50005072
TargetGlutamate receptor ionotropic, NMDA 1(RAT)
Merck Sharp And Dohme Research Laboratories
Curated by ChEMBL
LigandPNGBDBM50005072(5,7-Dichloro-4-(3-p-tolyl-ureido)-1,2,3,4-tetrahyd...)
Affinity DataIC50:  5nM. Assay description: Inhibition of [3H]- glycine binding to NMDA receptor from rat cortical membranes.
In DepthDetails ArticlePubMed