BDBM50005113 7-(2,5-Dihydroxy-3,4,6-trimethyl-phenyl)-7-(4-fluoro-phenyl)-heptanoic acid::CHEMBL70314
SMILES Cc1c(C)c(O)c(C(CCCCCC(O)=O)c2ccc(F)cc2)c(C)c1O
InChI Key InChIKey=QBZKMUITKDUXRQ-UHFFFAOYSA-N
Data  1 IC50
  Tab Delimited (TSV)   2D SDfile   Computed 3D by Vconf -m prep SDfile
Find this compound or compounds like it in BindingDB:
Activity Spreadsheet -- Enzyme Inhibition Constant Data from BindingDB
Found 1 hit for monomerid = 50005113
TargetThromboxane A2 receptor(Homo sapiens (Human))
Takeda Chemical Industries
Curated by ChEMBL
LigandPNGBDBM50005113(7-(2,5-Dihydroxy-3,4,6-trimethyl-phenyl)-7-(4-fluo...)
Affinity DataIC50:  200nM. Assay description: Compound was evaluated for its ability to inhibit specific binding of [3H]-U-46,619 to Thromboxane A2/ Prostaglandin H2 receptor in guinea pig platel...
In DepthDetails ArticlePubMed