BDBM50005140 1-(3-Chloro-phenyl)-4-pentyl-piperazine::CHEMBL27378
SMILES CCCCCN1CCN(CC1)c1cccc(Cl)c1
InChI Key InChIKey=UAZUOYAUJDOLHA-UHFFFAOYSA-N
Data  4 KI
  Tab Delimited (TSV)   2D SDfile   Computed 3D by Vconf -m prep SDfile
Find this compound or compounds like it in BindingDB:
Activity Spreadsheet -- Enzyme Inhibition Constant Data from BindingDB
Found 4 hits for monomerid = 50005140
Target5-hydroxytryptamine receptor 1A(Rattus norvegicus (rat))
Polish Academy Of Sciences
Curated by ChEMBL
LigandPNGBDBM50005140(1-(3-Chloro-phenyl)-4-pentyl-piperazine | CHEMBL27...)
Affinity DataKi:  5.5nM. Assay description: In vitro ability to displace [3H]-8-hydroxy-2-(di-n-propylamino) tetralin binding from 5-hydroxytryptamine 1A receptor site in rat brain hippocampus
In DepthDetails ArticlePubMed
Target5-hydroxytryptamine receptor 1A(Rattus norvegicus (rat))
Polish Academy Of Sciences
Curated by ChEMBL
LigandPNGBDBM50005140(1-(3-Chloro-phenyl)-4-pentyl-piperazine | CHEMBL27...)
Affinity DataKi:  5.5nM. Assay description: Binding affinity of a compound to rat brain 5-hydroxytryptamine 1A (serotonin) receptor assayed by radiolabeled [3H]-8-OH-DPAT ligand displacement
In DepthDetails ArticlePubMed
Target5-hydroxytryptamine receptor 1A(Rattus norvegicus (rat))
Polish Academy Of Sciences
Curated by ChEMBL
LigandPNGBDBM50005140(1-(3-Chloro-phenyl)-4-pentyl-piperazine | CHEMBL27...)
Affinity DataKi:  5.5nM. Assay description: Displacement of radioligand [3H]-2-(di-N-propylamino)-8-hydroxytetralin from 5-hydroxytryptamine 1A receptor in rat frontal cortex homogenate (experi...
In DepthDetails ArticlePubMed
Target5-hydroxytryptamine receptor 1A(Rattus norvegicus (rat))
Polish Academy Of Sciences
Curated by ChEMBL
LigandPNGBDBM50005140(1-(3-Chloro-phenyl)-4-pentyl-piperazine | CHEMBL27...)
Affinity DataKi:  7.80nM. Assay description: Displacement of radioligand [3H]2-(di-N-propylamino)-8-hydroxytetralin from 5-hydroxytryptamine 1A receptor in rat frontal cortex homogenate (experim...
In DepthDetails ArticlePubMed