BDBM50005176 4-{{2-[4-(4-Chloro-benzenesulfonylaminocarbonyl)-benzoylamino]-3-methyl-butyryl}-[(3,3,3-trifluoro-1-isopropyl-2-oxo-propylcarbamoyl)-methyl]-amino}-piperidine-1-carboxylic acid ethyl ester::CHEMBL160570
SMILES CCOC(=O)N1CCC(CC1)N(CC(=O)NC(C(C)C)C(=O)C(F)(F)F)C(=O)C(NC(=O)c1ccc(cc1)C(=O)NS(=O)(=O)c1ccc(Cl)cc1)C(C)C
InChI Key InChIKey=UTMHJLQMVSNZMR-UHFFFAOYSA-N
Data  1 IC50
  Tab Delimited (TSV)   2D SDfile   Computed 3D by Vconf -m prep SDfile
Find this compound or compounds like it in BindingDB:
Activity Spreadsheet -- Enzyme Inhibition Constant Data from BindingDB
Found 1 hit for monomerid = 50005176
TargetNeutrophil elastase(Homo sapiens (Human))
Boehringer Ingelheim Pharmaceuticals
Curated by ChEMBL
LigandPNGBDBM50005176(4-{{2-[4-(4-Chloro-benzenesulfonylaminocarbonyl)-b...)
Affinity DataIC50:  57nM. Assay description: In vitro inhibitory activity against human leukocyte elastase
In DepthDetails ArticlePubMed